Reaction Details
TargetSerine/threonine-protein kinase B-raf
LigandBDBM26051
Substrate/CompetitorBDBM26040
Meas. Tech.Fluorescence Anisoptrophy Kinase Binding Assay
pH7.5±n/a
Temperature295.15±n/a K
Kd 0.9±n/a nM
Citation Takle, AKBamford, MJDavies, SDavis, RPDean, DKGaiba, AIrving, EAKing, FDNaylor, AParr, CARay, AMReith, ADSmith, BBStaton, PCSteadman, JGStean, TOWilson, DM The identification of potent, selective and CNS penetrant furan-based inhibitors of B-Raf kinase. Bioorg Med Chem Lett18:4373-6 (2008) 
 
Serine/threonine-protein kinase B-raf
Name:Serine/threonine-protein kinase B-raf
Type:Serine/threonine-protein kinase
Mol. Mass.:84446.00
Organism:Homo sapiens (Human)
Description:P15056
Residue:766
BDBM26051
BDBM26040
NameBDBM26051
Synonyms:[2-(4-{5-[(1E)-1-(hydroxyimino)-2,3-dihydro-1H-inden-5-yl]-4-(pyridin-4-yl)furan-2-yl}phenoxy)ethyl]dimethylamine | furan-based compound, 12
TypeSmall organic molecule
Emp. Form.C28H27N3O3
Mol. Mass.453.5323
SMILESCN(C)CCOc1ccc(cc1)-c1cc(c(o1)-c1ccc2C(CCc2c1)N=O)-c1ccncc1