Reaction Details
TargetSerine/threonine-protein kinase B-raf
LigandBDBM26054
Substrate/CompetitorBDBM26040
Meas. Tech.Fluorescence Anisoptrophy Kinase Binding Assay
pH7.5±n/a
Temperature295.15±n/a K
Kd 2.7±n/a nM
Citation Takle, AKBamford, MJDavies, SDavis, RPDean, DKGaiba, AIrving, EAKing, FDNaylor, AParr, CARay, AMReith, ADSmith, BBStaton, PCSteadman, JGStean, TOWilson, DM The identification of potent, selective and CNS penetrant furan-based inhibitors of B-Raf kinase. Bioorg Med Chem Lett18:4373-6 (2008) 
 
Serine/threonine-protein kinase B-raf
Name:Serine/threonine-protein kinase B-raf
Type:Serine/threonine-protein kinase
Mol. Mass.:84446.00
Organism:Homo sapiens (Human)
Description:P15056
Residue:766
BDBM26054
BDBM26040
NameBDBM26054
Synonyms:(1E)-5-{5-[1-(2-methoxyethyl)piperidin-4-yl]-2-(pyridin-4-yl)furan-3-yl}-2,3-dihydro-1H-indene-1-hydroxylamine | furan-based compound, 15
TypeSmall organic molecule
Emp. Form.C26H29N3O3
Mol. Mass.431.5268
SMILESCOCCN1CCC(CC1)c1cc(c(o1)-c1ccncc1)-c1ccc2C(CCc2c1)N=O