Reaction Details
TargetAdenosine receptor A2a
LigandBDBM26234
Substrate/CompetitorBDBM21190
Meas. Tech.Receptor Binding Assay
pH7.4±n/a
Temperature295.15±n/a K
Ki 0.92±0.13 nM
Citation Zhang, XTellew, JELuo, ZMoorjani, MLin, ELanier, MCChen, YWilliams, JPSaunders, JLechner, SMMarkison, SJoswig, TPetroski, RPiercey, JKargo, WMalany, SSantos, MGross, RSWen, JJalali, KO'Brien, ZStotz, CECrespo, MIDiaz, JLSlee, DH Lead Optimization of 4-Acetylamino-2-(3,5-dimethylpyrazol-1-yl)-6-pyridylpyrimidines as A2A Adenosine Receptor Antagonists for the Treatment of Parkinson's Disease. J Med Chem51:7099-7110 (2008) 
 
Adenosine receptor A2a
Name:Adenosine receptor A2a
Type:G Protein-Coupled Receptor (GPCR)
Mol. Mass.:44716.46
Organism:Homo sapiens (Human)
Description:P29274
Residue:412
BDBM26234
BDBM21190
NameBDBM26234
Synonyms:CHEMBL486950 pyrazolylpyrimidine derivative, 6d
TypeSmall organic molecule
Emp. Form.C18H19N5O2
Mol. Mass.337.3758
SMILESCOc1cccc(c1)-c1cc(NC(C)=O)nc(n1)-n1nc(C)cc1C