Reaction Details
TargetAdenosine receptor A2a
LigandBDBM26241
Substrate/CompetitorBDBM21190
Meas. Tech.Receptor Binding Assay
pH7.4±n/a
Temperature295.15±n/a K
Ki 1.8±0.4 nM
Citation Zhang, XTellew, JELuo, ZMoorjani, MLin, ELanier, MCChen, YWilliams, JPSaunders, JLechner, SMMarkison, SJoswig, TPetroski, RPiercey, JKargo, WMalany, SSantos, MGross, RSWen, JJalali, KO'Brien, ZStotz, CECrespo, MIDiaz, JLSlee, DH Lead Optimization of 4-Acetylamino-2-(3,5-dimethylpyrazol-1-yl)-6-pyridylpyrimidines as A2A Adenosine Receptor Antagonists for the Treatment of Parkinson's Disease. J Med Chem51:7099-7110 (2008) 
 
Adenosine receptor A2a
Name:Adenosine receptor A2a
Type:G Protein-Coupled Receptor (GPCR)
Mol. Mass.:44716.46
Organism:Homo sapiens (Human)
Description:P29274
Residue:412
BDBM26241
BDBM21190
NameBDBM26241
Synonyms:N-[2-(3,5-dimethyl-1H-pyrazol-1-yl)-6-(5-methoxypyridin-3-yl)pyrimidin-4-yl]propanamide | pyrazolylpyrimidine derivative, 9b
TypeSmall organic molecule
Emp. Form.C18H20N6O2
Mol. Mass.352.3904
SMILESCCC(=O)Nc1cc(nc(n1)-n1nc(C)cc1C)-c1cncc(OC)c1