Reaction Details
TargetAdenosine receptor A1
LigandBDBM26250
Substrate/CompetitorBDBM21173
Meas. Tech.Receptor Binding Assay
Ki 7.2±n/a nM
Citation Zhang, XTellew, JELuo, ZMoorjani, MLin, ELanier, MCChen, YWilliams, JPSaunders, JLechner, SMMarkison, SJoswig, TPetroski, RPiercey, JKargo, WMalany, SSantos, MGross, RSWen, JJalali, KO'Brien, ZStotz, CECrespo, MIDiaz, JLSlee, DH Lead Optimization of 4-Acetylamino-2-(3,5-dimethylpyrazol-1-yl)-6-pyridylpyrimidines as A2A Adenosine Receptor Antagonists for the Treatment of Parkinson's Disease. J Med Chem51:7099-7110 (2008) 
 
Adenosine receptor A1
Name:Adenosine receptor A1
Type:G Protein-Coupled Receptor (GPCR)
Mol. Mass.:36520.92
Organism:Homo sapiens (Human)
Description:P30542
Residue:326
BDBM26250
BDBM21173
NameBDBM26250
Synonyms:N-[2-(3,5-dimethyl-1H-pyrazol-1-yl)-6-[6-(pyrrolidin-1-yl)pyridin-2-yl]pyrimidin-4-yl]acetamide | pyrazolylpyrimidine derivative, 16d
TypeSmall organic molecule
Emp. Form.C20H23N7O
Mol. Mass.377.4429
SMILESCC(=O)Nc1cc(nc(n1)-n1nc(C)cc1C)-c1cccc(n1)N1CCCC1