Reaction Details
TargetAndrogen receptor
LigandBDBM18665
Substrate/CompetitorBDBM26258
Meas. Tech.Competitive Radioligand Displacement Assay
pH7.4±n/a
Temperature277.15±n/a K
Ki 4.0±0.7 nM
Citation Bohl, CEWu, ZChen, JMohler, MLYang, JHwang, DJMustafa, SMiller, DDBell, CEDalton, JT Effect of B-ring substitution pattern on binding mode of propionamide selective androgen receptor modulators. Bioorg Med Chem Lett18:5567-70 (2008) 
 
Androgen receptor
Name:Androgen receptor
Type:Enzyme
Mol. Mass.:98219.08
Organism:Rattus norvegicus (Rat)
Description:P15207
Residue:902
BDBM18665
BDBM26258
NameBDBM18665
Synonyms:(2S)-3-(4-acetamidophenoxy)-2-hydroxy-2-methyl-N-[4-nitro-3-(trifluoromethyl)phenyl]propanamide CHEMBL125236 | Nonsteroidal AR Ligand, S-6
TypeSmall organic molecule
Emp. Form.C19H18F3N3O6
Mol. Mass.441.3579
SMILESCC(=O)Nc1ccc(OC[C@](C)(O)C(=O)Nc2ccc(c(c2)C(F)(F)F)[N+]([O-])=O)cc1