Reaction Details
TargetGamma-aminobutyric acid receptor subunit alpha-1 [A160C]/beta-2 [26-512]/gamma-2 [40-467]
LigandBDBM26263
Substrate/CompetitorBDBM26263
Meas. Tech.Radioligand Binding Assay
Temperature298.15±n/a K
Ki 4.0±n/a nM
Commentsextracted
Citation Hanson, SMMorlock, EVSatyshur, KACzajkowski, C Structural Requirements for Eszopiclone and Zolpidem Binding to the gamma-Aminobutyric Acid Type-A (GABAA) Receptor Are Different. J Med Chem51:7243-52 (2008) 
 
Gamma-aminobutyric acid receptor subunit alpha-1 [A160C]/beta-2 [26-512]/gamma-2 [40-467]
Name:Gamma-aminobutyric acid receptor subunit alpha-1 [A160C]/beta-2 [26-512]/gamma-2 [40-467]
Synonyms:GABAA Receptor Mutant, alpha-1 (A160C), beta-2, gamma-2
Type:Protein Complex
Mol. Mass.:n/a
Description:n/a
Components:This complex has 3 components.
Component 1
Name:Gamma-aminobutyric acid receptor subunit gamma-2 [40-467]
Type:Ionic channel
Mol. Mass.:49862.76
Organism:Homo sapiens (Human)
Description:P18507[40-467]
Residue:428
Component 2
Name:Gamma-aminobutyric acid receptor subunit beta-2 [26-512]
Synonyms:GABA(A) receptor subunit beta-2 GABRB2 Gamma-aminobutyric acid receptor subunit beta-2
Type:Ionic channel
Mol. Mass.:56212.32
Organism:Homo sapiens (Human)
Description:P47870[26-512]
Residue:487
Component 3
Name:Gamma-aminobutyric acid receptor subunit alpha-1 [A160C]
Synonyms:GABA(A) receptor subunit alpha-1 benzodiazepine binding site loop B mutant GABRA1 | GBRA1_HUMAN
Type:Ionic channel
Mol. Mass.:48839.87
Organism:Homo sapiens (Human)
Description:P14867[A160C]
Residue:429
BDBM26263
BDBM26263
NameBDBM26263
Synonyms:Anexate FLUMAZENIL Romazicon ethyl 12-fluoro-8-methyl-9-oxo-2,4,8-triazatricyclo[8.4.0.0^{2,6}]tetradeca-1(14),3,5,10,12-pentaene-5-carboxylate
TypeSmall organic molecule
Emp. Form.C15H14FN3O3
Mol. Mass.303.2884
SMILESCCOC(=O)c1ncn-2c1CN(C)C(=O)c1cc(F)ccc-21