Reaction Details
TargetMatrix metalloproteinase-9
LigandBDBM26545
Substrate/CompetitorBDBM23499
Meas. Tech.MMP Inhibition Assay
pH7.4±n/a
Temperature295.15±n/a K
Ki 90±n/a nM
Citation Govinda Rao, BBandarage, UKWang, TCome, JHPerola, EWei, YTian, SKSaunders, JO Novel thiol-based TACE inhibitors: rational design, synthesis, and SAR of thiol-containing aryl sulfonamides. Bioorg Med Chem Lett17:2250-3 (2007) 
 
Matrix metalloproteinase-9
Name:Matrix metalloproteinase-9
Type:Enzyme
Mol. Mass.:78452.28
Organism:Homo sapiens (Human)
Description:P14780
Residue:707
BDBM26545
BDBM23499
NameBDBM26545
Synonyms:1-{[4-(but-2-yn-1-yloxy)benzene]sulfonyl}piperidine-3-thiol thiol-arylsulfonamide, 4d
TypeSmall organic molecule
Emp. Form.C15H19NO3S2
Mol. Mass.325.446
SMILESCC#CCOc1ccc(cc1)S(=O)(=O)N1CCCC(S)C1