Reaction Details
TargetFatty-acid amide hydrolase 1
LigandBDBM26739
Substrate/CompetitorBDBM23028
Meas. Tech.FAAH Inhibition Assay (30 min Preincubation)
pH7.4±n/a
Temperature303.15±n/a K
IC50 572±n/a nM
Citation Ahn, KJohnson, DSFitzgerald, LRLiimatta, MArendse, AStevenson, TLund, ETNugent, RANomanbhoy, TKAlexander, JPCravatt, BF Novel mechanistic class of fatty acid amide hydrolase inhibitors with remarkable selectivity. Biochemistry46:13019-30 (2007) 
 
Fatty-acid amide hydrolase 1
Name:Fatty-acid amide hydrolase 1
Type:Protein
Mol. Mass.:63071.19
Organism:Homo sapiens (Human)
Description:O00519
Residue:579
BDBM26739
BDBM23028
NameBDBM26739
Synonyms:3-(3-carbamoylphenyl)phenyl N-cyclohexylcarbamate URB 597 URB597 | US9187413, 1a (URB597)
TypeSmall organic molecule
Emp. Form.C20H22N2O3
Mol. Mass.338.4003
SMILESNC(=O)c1cccc(c1)-c1cccc(OC(=O)NC2CCCCC2)c1