Reaction Details
TargetTyrosine-protein kinase Fgr
LigandBDBM50184782
Substrate/Competitorn/a
Meas. Tech.Kinase Screening Assay
IC50<10.00±n/a nM
Citation Unciti-Broceta, AFraser, CO. Carragher, N Compounds US Patent US10294227 Publication Date 5/21/2019
 
Tyrosine-protein kinase Fgr
Name:Tyrosine-protein kinase Fgr
Type:protein
Mol. Mass.:59469.88
Organism:Homo sapiens (Human)
Description:P09769
Residue:529
BDBM50184782
NameBDBM50184782
Synonyms:CHEMBL3824228 | US10294227, Code 543
TypeSmall organic molecule
Emp. Form.C25H36N8O2
Mol. Mass.480.6057
SMILESCN(C)C1CCN(CCn2nc(-c3ccc(NC(=O)OC(C)(C)C)cc3)c3c(N)ncnc23)CC1