Reaction Details
TargetTyrosine-protein kinase FRK
LigandBDBM50184782
Substrate/Competitorn/a
Meas. Tech.Kinase Screening Assay
IC50 550±n/a nM
Citation Unciti-Broceta, AFraser, CO. Carragher, N Compounds US Patent US10294227 Publication Date 5/21/2019
 
Tyrosine-protein kinase FRK
Name:Tyrosine-protein kinase FRK
Type:Tyrosine-protein kinase
Mol. Mass.:58254.41
Organism:Homo sapiens (Human)
Description:P42685
Residue:505
BDBM50184782
NameBDBM50184782
Synonyms:CHEMBL3824228 | US10294227, Code 543
TypeSmall organic molecule
Emp. Form.C25H36N8O2
Mol. Mass.480.6057
SMILESCN(C)C1CCN(CCn2nc(-c3ccc(NC(=O)OC(C)(C)C)cc3)c3c(N)ncnc23)CC1