Reaction Details
TargetVitamin D3 receptor
LigandBDBM263412
Substrate/Competitorn/a
Meas. Tech.Dopamine D3 Receptor Binding Test
Ki 0.093±n/a nM
Citation Li, JChen, XMa, ZZhang, LCui, N Benzoisothiazole compounds and methods of treating schizophrenia US Patent US9550741 Publication Date 1/24/2017
 
Vitamin D3 receptor
Name:Vitamin D3 receptor
Type:Protein
Mol. Mass.:48288.72
Organism:Homo sapiens (Human)
Description:P11473
Residue:427
BDBM263412
NameBDBM263412
Synonyms:US9550741, II-17
TypeSmall organic molecule
Emp. Form.C23H31N5O2S2
Mol. Mass.473.655
SMILESO=S(=O)(N[C@@H]1CC[C@H](CCN2CCN(CC2)c2nsc3ccccc23)CC1)c1ccc[nH]1