Reaction Details
TargetVitamin D3 receptor
LigandBDBM263449
Substrate/Competitorn/a
Meas. Tech.Dopamine D3 Receptor Binding Test
Ki 0.090±n/a nM
Citation Li, JChen, XMa, ZZhang, LCui, N Benzoisothiazole compounds and methods of treating schizophrenia US Patent US9550741 Publication Date 1/24/2017
 
Vitamin D3 receptor
Name:Vitamin D3 receptor
Type:Protein
Mol. Mass.:48288.72
Organism:Homo sapiens (Human)
Description:P11473
Residue:427
BDBM263449
NameBDBM263449
Synonyms:US9550741, RGH-188
TypeSmall organic molecule
Emp. Form.C21H32Cl2N4O
Mol. Mass.427.411
SMILESCN(C)C(=O)NC1CCC(CCN2CCN(CC2)c2cccc(Cl)c2Cl)CC1