Reaction Details
Target5-hydroxytryptamine receptor 1A
LigandBDBM263449
Substrate/Competitorn/a
Meas. Tech.5-HT1A Receptor Binding Test
pH7.4±n/a
Ki 2.16±n/a nM
Commentsextracted
Citation Li, JChen, XMa, ZZhang, LCui, N Benzoisothiazole compounds and methods of treating schizophrenia US Patent US9550741 Publication Date 1/24/2017
 
5-hydroxytryptamine receptor 1A
Name:5-hydroxytryptamine receptor 1A
Type:n/a
Mol. Mass.:46122.49
Organism:Homo sapiens (Human)
Description:n/a
Residue:422
BDBM263449
NameBDBM263449
Synonyms:US9550741, RGH-188
TypeSmall organic molecule
Emp. Form.C21H32Cl2N4O
Mol. Mass.427.411
SMILESCN(C)C(=O)NC1CCC(CCN2CCN(CC2)c2cccc(Cl)c2Cl)CC1