Reaction Details
TargetNociceptin receptor
LigandBDBM26915
Substrate/CompetitorBDBM21842
Meas. Tech.Radioligand Binding Assay
pH7.4±n/a
Temperature295.15±n/a K
Ki 3.8±n/a nM
Citation Caldwell, JPMatasi, JJFernandez, XMcLeod, RLZhang, HFawzi, ATulshian, DB Synthesis and structure-activity relationships of N-substituted spiropiperidines as nociceptin receptor ligands: part 2. Bioorg Med Chem Lett19:1164-7 (2009) 
 
Nociceptin receptor
Name:Nociceptin receptor
Type:G Protein-Coupled Receptor (GPCR)
Mol. Mass.:40702.87
Organism:Homo sapiens (Human)
Description:P41146
Residue:370
BDBM26915
BDBM21842
NameBDBM26915
Synonyms:8-[bis(2-chlorophenyl)methyl]-3-{2-[(cyclohexylmethyl)amino]ethyl}-1-phenyl-1,3,8-triazaspiro[4.5]decan-4-one | spiropiperidine analogue, 36
TypeSmall organic molecule
Emp. Form.C35H42Cl2N4O
Mol. Mass.605.64
SMILESClc1ccccc1C(N1CCC2(CC1)N(CN(CCNCC1CCCCC1)C2=O)c1ccccc1)c1ccccc1Cl