Reaction Details
TargetNociceptin receptor
LigandBDBM26927
Substrate/CompetitorBDBM21842
Meas. Tech.Radioligand Binding Assay
Ki 0.4±n/a nM
Citation Caldwell, JPMatasi, JJFernandez, XMcLeod, RLZhang, HFawzi, ATulshian, DB Synthesis and structure-activity relationships of N-substituted spiropiperidines as nociceptin receptor ligands: part 2. Bioorg Med Chem Lett19:1164-7 (2009) 
 
Nociceptin receptor
Name:Nociceptin receptor
Type:G Protein-Coupled Receptor (GPCR)
Mol. Mass.:40702.87
Organism:Homo sapiens (Human)
Description:P41146
Residue:370
BDBM26927
BDBM21842
NameBDBM26927
Synonyms:3-[2-(butylamino)ethyl]-8-[(2,6-dichlorophenyl)methyl]-1-phenyl-1,3,8-triazaspiro[4.5]decan-4-one | spiropiperidine analogue, 48
TypeSmall organic molecule
Emp. Form.C26H34Cl2N4O
Mol. Mass.489.48
SMILESCCCCNCCN1CN(c2ccccc2)C2(CCN(Cc3c(Cl)cccc3Cl)CC2)C1=O