Reaction Details
TargetCoagulation factor XI
LigandBDBM388554
Substrate/Competitorn/a
Meas. Tech.Factor XIa Assay
Ki 100.0±n/a nM
Citation Neelamkavil, SFEdmondson, SDHruza, AWHussain, ZLesburg, CMoningka, R Factor XIa inhibitors US Patent US9944643 Publication Date 4/17/2018
 
Coagulation factor XI
Name:Coagulation factor XI
Type:Enzyme
Mol. Mass.:70130.58
Organism:Homo sapiens (Human)
Description:P03951
Residue:625
BDBM388554
NameBDBM388554
Synonyms:Methyl [(7S)-7-({[4-(aminomethyl)-3-cyclopropylphenyl]carbonyl}amino)-2-oxo-1,2,3,4,5,6,7,9-octahydro-11,8-(azeno)-1,9-benzodiazacyclotridecin-14-yl]carbamate | US9944643, 1
TypeSmall organic molecule
Emp. Form.C28H33N6O4
Mol. Mass.517.5989
SMILESCOC(=O)Nc1ccc2-c3c[nH]c(n3)[C@H](CCCCC(=O)Nc2c1)NC(=O)c1ccc(C[NH3+])c(c1)C1CC1