Reaction Details
TargetCoagulation factor XI
LigandBDBM388638
Substrate/Competitorn/a
Meas. Tech.Factor XIa Assay
Ki 1100±n/a nM
Citation Neelamkavil, SFEdmondson, SDHruza, AWHussain, ZLesburg, CMoningka, R Factor XIa inhibitors US Patent US9944643 Publication Date 4/17/2018
 
Coagulation factor XI
Name:Coagulation factor XI
Type:Enzyme
Mol. Mass.:70130.58
Organism:Homo sapiens (Human)
Description:P03951
Residue:625
BDBM388638
NameBDBM388638
Synonyms:US9944643, 2
TypeSmall organic molecule
Emp. Form.C27H33N7O4
Mol. Mass.519.5943
SMILESCOC(=O)Nc1ccc2-c3c[nH]c([nH+]3)[C@H](CCCCC(=O)Nc2c1)NC(=O)c1cnc(C[NH3+])c(c1)C1CC1