Reaction Details
TargetCoagulation factor XI
LigandBDBM388639
Substrate/Competitorn/a
Meas. Tech.Factor XIa Assay
Ki 100.0±n/a nM
Citation Neelamkavil, SFEdmondson, SDHruza, AWHussain, ZLesburg, CMoningka, R Factor XIa inhibitors US Patent US9944643 Publication Date 4/17/2018
 
Coagulation factor XI
Name:Coagulation factor XI
Type:Enzyme
Mol. Mass.:70130.58
Organism:Homo sapiens (Human)
Description:P03951
Residue:625
BDBM388639
NameBDBM388639
Synonyms:US9944643, 3
TypeSmall organic molecule
Emp. Form.C29H35N6O5
Mol. Mass.547.6249
SMILESCOC(=O)Nc1ccc2-c3c[nH]c(n3)[C@H](CCCC[C@@H]([NH2+]c2c1)C(O)=O)NC(=O)c1ccc(CN)c(c1)C1CC1