Reaction Details
TargetCoagulation factor XI
LigandBDBM388640
Substrate/Competitorn/a
Meas. Tech.Factor XIa Assay
Ki 30.0±n/a nM
Citation Neelamkavil, SFEdmondson, SDHruza, AWHussain, ZLesburg, CMoningka, R Factor XIa inhibitors US Patent US9944643 Publication Date 4/17/2018
 
Coagulation factor XI
Name:Coagulation factor XI
Type:Enzyme
Mol. Mass.:70130.58
Organism:Homo sapiens (Human)
Description:P03951
Residue:625
BDBM388640
NameBDBM388640
Synonyms:US9944643, 4
TypeSmall organic molecule
Emp. Form.C31H36N5O4
Mol. Mass.542.6481
SMILESCOC(=O)Nc1ccc-2c(NC(=O)[C@@H](C)CCC[C@H](NC(=O)c3ccc(C[NH3+])c(c3)C3CC3)c3cc-2ccn3)c1