Reaction Details
TargetCoagulation factor XI
LigandBDBM388641
Substrate/Competitorn/a
Meas. Tech.Factor XIa Assay
Ki 50.0±n/a nM
Citation Neelamkavil, SFEdmondson, SDHruza, AWHussain, ZLesburg, CMoningka, R Factor XIa inhibitors US Patent US9944643 Publication Date 4/17/2018
 
Coagulation factor XI
Name:Coagulation factor XI
Type:Enzyme
Mol. Mass.:70130.58
Organism:Homo sapiens (Human)
Description:P03951
Residue:625
BDBM388641
NameBDBM388641
Synonyms:US9944643, 5
TypeSmall organic molecule
Emp. Form.C28H32ClN6O4
Mol. Mass.552.044
SMILESCOC(=O)Nc1ccc2-c3nc([nH]c3Cl)[C@H](CCCCC(=O)Nc2c1)NC(=O)c1ccc(C[NH3+])c(c1)C1CC1