Reaction Details
TargetCoagulation factor XI
LigandBDBM388645
Substrate/Competitorn/a
Meas. Tech.Factor XIa Assay
Ki 300±n/a nM
Citation Neelamkavil, SFEdmondson, SDHruza, AWHussain, ZLesburg, CMoningka, R Factor XIa inhibitors US Patent US9944643 Publication Date 4/17/2018
 
Coagulation factor XI
Name:Coagulation factor XI
Type:Enzyme
Mol. Mass.:70130.58
Organism:Homo sapiens (Human)
Description:P03951
Residue:625
BDBM388645
NameBDBM388645
Synonyms:US9944643, 7
TypeSmall organic molecule
Emp. Form.C35H41N5O4
Mol. Mass.595.7311
SMILESC[C@H]1CCC[C@H](NC(=O)c2ccc(CN)c(c2)C2CC2)c2cc(ccn2)-c2ccc(NC(=O)OC3CCCC3)cc2NC1=O