Reaction Details
TargetCoagulation factor XI
LigandBDBM388646
Substrate/Competitorn/a
Meas. Tech.Factor XIa Assay
Ki 100.0±n/a nM
Citation Neelamkavil, SFEdmondson, SDHruza, AWHussain, ZLesburg, CMoningka, R Factor XIa inhibitors US Patent US9944643 Publication Date 4/17/2018
 
Coagulation factor XI
Name:Coagulation factor XI
Type:Enzyme
Mol. Mass.:70130.58
Organism:Homo sapiens (Human)
Description:P03951
Residue:625
BDBM388646
NameBDBM388646
Synonyms:US9944643, 8
TypeSmall organic molecule
Emp. Form.C33H39N5O5
Mol. Mass.585.6933
SMILESCOCCOC(=O)Nc1ccc-2c(NC(=O)[C@@H](C)CCC[C@H](NC(=O)c3ccc(CN)c(c3)C3CC3)c3cc-2ccn3)c1