Reaction Details
TargetNitric oxide synthase, endothelial
LigandBDBM50014716
Substrate/Competitorn/a
Meas. Tech.Inhibition Assay
Ki 19417±1058 nM
Citation Silverman, RBJing, QKang, SWang, H Mammalian and bacterial nitric oxide synthase inhibitors US Patent US9951014 Publication Date 4/24/2018
 
Nitric oxide synthase, endothelial
Name:Nitric oxide synthase, endothelial
Type:Enzyme Catalytic Domain
Mol. Mass.:133297.84
Organism:Homo sapiens (Human)
Description:P29474
Residue:1203
BDBM50014716
NameBDBM50014716
Synonyms:CHEMBL3262025 US9951014, Name 8S
TypeSmall organic molecule
Emp. Form.C22H28N6
Mol. Mass.376.4979
SMILESCc1cc(N)nc(CCc2cncc(c2)[C@@H](CN)Cc2cc(C)cc(N)n2)c1