Reaction Details
TargetPlasma kallikrein
LigandBDBM241566
Substrate/Competitorn/a
Meas. Tech.Inhibition Assay
Ki 1.000±n/a nM
Citation Yang, WCorte, JRGilligan, PJPinto, DJEwing, WRDilger, AKWang, YFang, TPabbisetty, KBSmith, II, LM Dihydropyridone P1 as factor XIa inhibitors US Patent US9951071 Publication Date 4/24/2018
 
Plasma kallikrein
Name:Plasma kallikrein
Type:Protein
Mol. Mass.:71391.16
Organism:Homo sapiens (Human)
Description:P03952
Residue:638
BDBM241566
NameBDBM241566
Synonyms:US9409908, 198 | US9951071, Example 198
TypeSmall organic molecule
Emp. Form.C30H27ClF2N4O4
Mol. Mass.581.01
SMILESC[C@@H]1CCC[C@H](N2CCC(=CC2=O)c2c(F)ccc(Cl)c2F)c2cc(ccn2)-c2cc(C(O)=O)c(N)cc2NC1=O