Reaction Details
TargetPoly [ADP-ribose] polymerase 1
LigandBDBM27550
Substrate/CompetitorBDBM27089
Meas. Tech.PARP-1 Enzyme Assay
pH7.4±n/a
Temperature295.15±n/a K
IC50 8±n/a nM
Citation Menear, KAAdcock, CBoulter, RCockcroft, XLCopsey, LCranston, ADillon, KJDrzewiecki, JGarman, SGomez, SJavaid, HKerrigan, FKnights, CLau, ALoh, VMMatthews, ITMoore, SO'Connor, MJSmith, GCMartin, NM 4-[3-(4-cyclopropanecarbonylpiperazine-1-carbonyl)-4-fluorobenzyl]-2H-phthalazin-1-one: a novel bioavailable inhibitor of poly(ADP-ribose) polymerase-1. J Med Chem51:6581-91 (2008) 
 
Poly [ADP-ribose] polymerase 1
Name:Poly [ADP-ribose] polymerase 1
Type:n/a
Mol. Mass.:113114.22
Organism:Homo sapiens (Human)
Description:P09874
Residue:1014
BDBM27550
BDBM27089
NameBDBM27550
Synonyms:4-[(3-{[4-(morpholin-4-ylcarbonyl)piperazin-1-yl]carbonyl}phenyl)methyl]-1,2-dihydrophthalazin-1-one | Piperazine analogue, 31
TypeSmall organic molecule
Emp. Form.C25H27N5O4
Mol. Mass.461.513
SMILESO=C(N1CCOCC1)N1CCN(CC1)C(=O)c1cccc(Cc2n[nH]c(=O)c3ccccc23)c1