Reaction Details
TargetPoly [ADP-ribose] polymerase 1
LigandBDBM27562
Substrate/CompetitorBDBM27089
Meas. Tech.PARP-1 Enzyme Assay
pH7.4±n/a
Temperature295.15±n/a K
IC50 5±n/a nM
Citation Menear, KAAdcock, CBoulter, RCockcroft, XLCopsey, LCranston, ADillon, KJDrzewiecki, JGarman, SGomez, SJavaid, HKerrigan, FKnights, CLau, ALoh, VMMatthews, ITMoore, SO'Connor, MJSmith, GCMartin, NM 4-[3-(4-cyclopropanecarbonylpiperazine-1-carbonyl)-4-fluorobenzyl]-2H-phthalazin-1-one: a novel bioavailable inhibitor of poly(ADP-ribose) polymerase-1. J Med Chem51:6581-91 (2008) 
 
Poly [ADP-ribose] polymerase 1
Name:Poly [ADP-ribose] polymerase 1
Type:n/a
Mol. Mass.:113114.22
Organism:Homo sapiens (Human)
Description:P09874
Residue:1014
BDBM27562
BDBM27089
NameBDBM27562
Synonyms:4-({3-[(4-butylpiperazin-1-yl)carbonyl]-4-fluorophenyl}methyl)-1,2-dihydrophthalazin-1-one | Alkylpiperazine analogue, 43
TypeSmall organic molecule
Emp. Form.C24H27FN4O2
Mol. Mass.422.4952
SMILESCCCCN1CCN(CC1)C(=O)c1cc(Cc2n[nH]c(=O)c3ccccc23)ccc1F