Reaction Details
TargetPoly [ADP-ribose] polymerase 1
LigandBDBM27570
Substrate/CompetitorBDBM27089
Meas. Tech.PARP-1 Enzyme Assay
IC50 2±n/a nM
Citation Menear, KAAdcock, CBoulter, RCockcroft, XLCopsey, LCranston, ADillon, KJDrzewiecki, JGarman, SGomez, SJavaid, HKerrigan, FKnights, CLau, ALoh, VMMatthews, ITMoore, SO'Connor, MJSmith, GCMartin, NM 4-[3-(4-cyclopropanecarbonylpiperazine-1-carbonyl)-4-fluorobenzyl]-2H-phthalazin-1-one: a novel bioavailable inhibitor of poly(ADP-ribose) polymerase-1. J Med Chem51:6581-91 (2008) 
 
Poly [ADP-ribose] polymerase 1
Name:Poly [ADP-ribose] polymerase 1
Type:n/a
Mol. Mass.:113114.22
Organism:Homo sapiens (Human)
Description:P09874
Residue:1014
BDBM27570
BDBM27089
NameBDBM27570
Synonyms:4-[(4-fluoro-3-{[4-(oxolan-3-ylcarbonyl)piperazin-1-yl]carbonyl}phenyl)methyl]-1,2-dihydrophthalazin-1-one | Acylpiperazine analogue, 51
TypeSmall organic molecule
Emp. Form.C25H25FN4O4
Mol. Mass.464.4888
SMILESFc1ccc(Cc2n[nH]c(=O)c3ccccc23)cc1C(=O)N1CCN(CC1)C(=O)C1CCOC1