Reaction Details
TargetCalmodulin-domain protein kinase 1
LigandBDBM50446171
Substrate/Competitorn/a
Meas. Tech.Inhibition Assay
IC50 7.00±n/a nM
Citation Fan, EVan Voorhis, WCZhang, ZHuang, WOjo, KK 5-aminopyrazole-4-carboxamide inhibitors of CDPK1 from T. gondii and C. parvum US Patent US9956214 Publication Date 5/1/2018
 
Calmodulin-domain protein kinase 1
Name:Calmodulin-domain protein kinase 1
Type:Enzyme Catalytic Domain
Mol. Mass.:57248.42
Organism:Toxoplasma gondii
Description:n/a
Residue:507
BDBM50446171
NameBDBM50446171
Synonyms:CHEMBL3108999 US9956214, Compound 26
TypeSmall organic molecule
Emp. Form.C21H26N4O2
Mol. Mass.366.4567
SMILESCCCOc1ccc2cc(ccc2c1)-c1nn(c(N)c1C(N)=O)C(C)(C)C