Reaction Details
TargetCalcium-dependent protein kinase 1
LigandBDBM50446171
Substrate/Competitorn/a
Meas. Tech.Inhibition Assay
IC50 10.00±n/a nM
Citation Fan, EVan Voorhis, WCZhang, ZHuang, WOjo, KK 5-aminopyrazole-4-carboxamide inhibitors of CDPK1 from T. gondii and C. parvum US Patent US9956214 Publication Date 5/1/2018
 
Calcium-dependent protein kinase 1
Name:Calcium-dependent protein kinase 1
Synonyms:Calcium-dependent protein kinase 1 (CDPK1)
Type:Protein
Mol. Mass.:76617.33
Organism:Cryptosporidium parvum
Description:Q6S4W0
Residue:677
BDBM50446171
NameBDBM50446171
TypeSmall organic molecule
Emp. Form.C21H26N4O2
Mol. Mass.366.4567
SMILESCCCOc1ccc2cc(ccc2c1)-c1nn(c(N)c1C(N)=O)C(C)(C)C