Reaction Details
TargetPoly [ADP-ribose] polymerase 1
LigandBDBM27661
Substrate/CompetitorBDBM27089
Meas. Tech.PARP-1 Enzyme Assay
pH7.4±n/a
Temperature295.15±n/a K
IC50 8±n/a nM
Citation Menear, KAAdcock, CAlonso, FCBlackburn, KCopsey, LDrzewiecki, JFundo, ALe Gall, AGomez, SJavaid, HLence, CFMartin, NMMydlowski, CSmith, GC Novel alkoxybenzamide inhibitors of poly(ADP-ribose) polymerase. Bioorg Med Chem Lett18:3942-5 (2008) 
 
Poly [ADP-ribose] polymerase 1
Name:Poly [ADP-ribose] polymerase 1
Type:n/a
Mol. Mass.:113114.22
Organism:Homo sapiens (Human)
Description:P09874
Residue:1014
BDBM27661
BDBM27089
NameBDBM27661
Synonyms:4-({3-[(4-cyclopentanecarbonylpiperazin-1-yl)carbonyl]phenyl}methyl)-1,2-dihydrophthalazin-1-one | phthalazinone, 3
TypeSmall organic molecule
Emp. Form.C26H28N4O3
Mol. Mass.444.5255
SMILESO=C(C1CCCC1)N1CCN(CC1)C(=O)c1cccc(Cc2n[nH]c(=O)c3ccccc23)c1