Reaction Details
TargetPoly [ADP-ribose] polymerase 1
LigandBDBM27662
Substrate/CompetitorBDBM27089
Meas. Tech.PARP-1 Enzyme Assay
pH7.4±n/a
Temperature295.15±n/a K
IC50 5±n/a nM
Citation Menear, KAAdcock, CAlonso, FCBlackburn, KCopsey, LDrzewiecki, JFundo, ALe Gall, AGomez, SJavaid, HLence, CFMartin, NMMydlowski, CSmith, GC Novel alkoxybenzamide inhibitors of poly(ADP-ribose) polymerase. Bioorg Med Chem Lett18:3942-5 (2008) 
 
Poly [ADP-ribose] polymerase 1
Name:Poly [ADP-ribose] polymerase 1
Type:n/a
Mol. Mass.:113114.22
Organism:Homo sapiens (Human)
Description:P09874
Residue:1014
BDBM27662
BDBM27089
NameBDBM27662
Synonyms:4-[(3-{[4-(2-phenoxypropanoyl)piperazin-1-yl]carbonyl}phenyl)methyl]-1,2-dihydrophthalazin-1-one | phthalazinone, 4
TypeSmall organic molecule
Emp. Form.C29H28N4O4
Mol. Mass.496.557
SMILESCC(Oc1ccccc1)C(=O)N1CCN(CC1)C(=O)c1cccc(Cc2n[nH]c(=O)c3ccccc23)c1