Reaction Details
TargetPoly [ADP-ribose] polymerase 1
LigandBDBM27663
Substrate/CompetitorBDBM27089
Meas. Tech.PARP-1 Enzyme Assay
pH7.4±n/a
Temperature295.15±n/a K
IC50 18±n/a nM
Citation Menear, KAAdcock, CAlonso, FCBlackburn, KCopsey, LDrzewiecki, JFundo, ALe Gall, AGomez, SJavaid, HLence, CFMartin, NMMydlowski, CSmith, GC Novel alkoxybenzamide inhibitors of poly(ADP-ribose) polymerase. Bioorg Med Chem Lett18:3942-5 (2008) 
 
Poly [ADP-ribose] polymerase 1
Name:Poly [ADP-ribose] polymerase 1
Type:n/a
Mol. Mass.:113114.22
Organism:Homo sapiens (Human)
Description:P09874
Residue:1014
BDBM27663
BDBM27089
NameBDBM27663
Synonyms:2-{[3-(piperazin-1-ylcarbonyl)phenyl]methoxy}benzamide | substituted 2-benzyloxybenzamide, 5
TypeSmall organic molecule
Emp. Form.C19H21N3O3
Mol. Mass.339.3883
SMILESNC(=O)c1ccccc1OCc1cccc(c1)C(=O)N1CCNCC1