Reaction Details
TargetPoly [ADP-ribose] polymerase 1
LigandBDBM27667
Substrate/CompetitorBDBM27089
Meas. Tech.PARP-1 Enzyme Assay
pH7.4±n/a
Temperature295.15±n/a K
IC50 36±n/a nM
Citation Menear, KAAdcock, CAlonso, FCBlackburn, KCopsey, LDrzewiecki, JFundo, ALe Gall, AGomez, SJavaid, HLence, CFMartin, NMMydlowski, CSmith, GC Novel alkoxybenzamide inhibitors of poly(ADP-ribose) polymerase. Bioorg Med Chem Lett18:3942-5 (2008) 
 
Poly [ADP-ribose] polymerase 1
Name:Poly [ADP-ribose] polymerase 1
Type:n/a
Mol. Mass.:113114.22
Organism:Homo sapiens (Human)
Description:P09874
Residue:1014
BDBM27667
BDBM27089
NameBDBM27667
Synonyms:2-[(3-{[4-(2-phenoxypropanoyl)piperazin-1-yl]carbonyl}phenyl)methoxy]benzamide | substituted 2-benzyloxybenzamide, 9
TypeSmall organic molecule
Emp. Form.C28H29N3O5
Mol. Mass.487.547
SMILESCC(Oc1ccccc1)C(=O)N1CCN(CC1)C(=O)c1cccc(COc2ccccc2C(N)=O)c1