Reaction Details
TargetPoly [ADP-ribose] polymerase 1
LigandBDBM27671
Substrate/CompetitorBDBM27089
Meas. Tech.PARP-1 Enzyme Assay
pH7.4±n/a
Temperature295.15±n/a K
IC50 200±n/a nM
Citation Menear, KAAdcock, CAlonso, FCBlackburn, KCopsey, LDrzewiecki, JFundo, ALe Gall, AGomez, SJavaid, HLence, CFMartin, NMMydlowski, CSmith, GC Novel alkoxybenzamide inhibitors of poly(ADP-ribose) polymerase. Bioorg Med Chem Lett18:3942-5 (2008) 
 
Poly [ADP-ribose] polymerase 1
Name:Poly [ADP-ribose] polymerase 1
Type:n/a
Mol. Mass.:113114.22
Organism:Homo sapiens (Human)
Description:P09874
Residue:1014
BDBM27671
BDBM27089
NameBDBM27671
Synonyms:2-(2-{3-[(4-cyclopentanecarbonylpiperazin-1-yl)carbonyl]phenyl}ethoxy)benzamide | substituted 2-phenethyloxybenzamide, 13
TypeSmall organic molecule
Emp. Form.C26H31N3O4
Mol. Mass.449.542
SMILESNC(=O)c1ccccc1OCCc1cccc(c1)C(=O)N1CCN(CC1)C(=O)C1CCCC1