Reaction Details
TargetPoly [ADP-ribose] polymerase 1
LigandBDBM27676
Substrate/CompetitorBDBM27089
Meas. Tech.PARP-1 Enzyme Assay
pH7.4±n/a
Temperature295.15±n/a K
IC50 240±n/a nM
Citation Menear, KAAdcock, CAlonso, FCBlackburn, KCopsey, LDrzewiecki, JFundo, ALe Gall, AGomez, SJavaid, HLence, CFMartin, NMMydlowski, CSmith, GC Novel alkoxybenzamide inhibitors of poly(ADP-ribose) polymerase. Bioorg Med Chem Lett18:3942-5 (2008) 
 
Poly [ADP-ribose] polymerase 1
Name:Poly [ADP-ribose] polymerase 1
Type:n/a
Mol. Mass.:113114.22
Organism:Homo sapiens (Human)
Description:P09874
Residue:1014
BDBM27676
BDBM27089
NameBDBM27676
Synonyms:4,5-difluoro-2-{[4-fluoro-3-(piperazin-1-ylcarbonyl)phenyl]methoxy}benzamide | substituted 2-benzyloxyfluorobenzamide, 18
TypeSmall organic molecule
Emp. Form.C19H18F3N3O3
Mol. Mass.393.3597
SMILESNC(=O)c1cc(F)c(F)cc1OCc1ccc(F)c(c1)C(=O)N1CCNCC1