Reaction Details
TargetPoly [ADP-ribose] polymerase 2
LigandBDBM27711
Substrate/CompetitorBDBM27683
Meas. Tech.PARP Enzyme Inhibition Assay
Temperature298.15±n/a K
IC50 300±n/a nM
Commentsextracted
Citation Ishida, JYamamoto, HKido, YKamijo, KMurano, KMiyake, HOhkubo, MKinoshita, TWarizaya, MIwashita, AMihara, KMatsuoka, NHattori, K Discovery of potent and selective PARP-1 and PARP-2 inhibitors: SBDD analysis via a combination of X-ray structural study and homology modeling. Bioorg Med Chem14:1378-90 (2006) 
 
Poly [ADP-ribose] polymerase 2
Name:Poly [ADP-ribose] polymerase 2
Type:n/a
Mol. Mass.:63409.97
Organism:Mus musculus (Mouse)
Description:Alexis Biochemicals, Cat. no. ALX-201-064-C020
Residue:559
BDBM27711
BDBM27683
NameBDBM27711
Synonyms:2-{3-[4-(4-chlorophenyl)piperazin-1-yl]propyl}-3,4-dihydroquinazolin-4-one | quinazolinone analogue, 1g
TypeSmall organic molecule
Emp. Form.C21H23ClN4O
Mol. Mass.382.887
SMILESClc1ccc(cc1)N1CCN(CCCc2nc3ccccc3c(=O)[nH]2)CC1