Reaction Details
TargetPoly [ADP-ribose] polymerase 2
LigandBDBM27716
Substrate/CompetitorBDBM27683
Meas. Tech.PARP Enzyme Inhibition Assay
Temperature298.15±n/a K
IC50 90±n/a nM
Commentsextracted
Citation Ishida, JYamamoto, HKido, YKamijo, KMurano, KMiyake, HOhkubo, MKinoshita, TWarizaya, MIwashita, AMihara, KMatsuoka, NHattori, K Discovery of potent and selective PARP-1 and PARP-2 inhibitors: SBDD analysis via a combination of X-ray structural study and homology modeling. Bioorg Med Chem14:1378-90 (2006) 
 
Poly [ADP-ribose] polymerase 2
Name:Poly [ADP-ribose] polymerase 2
Type:n/a
Mol. Mass.:63409.97
Organism:Mus musculus (Mouse)
Description:Alexis Biochemicals, Cat. no. ALX-201-064-C020
Residue:559
BDBM27716
BDBM27683
NameBDBM27716
Synonyms:4-(4-(4-phenyl-5,6-dihydropyridin-1(2H)-yl)butyl)phthalazin-1(2H)-one 4-[4-(4-phenyl-1,2,3,6-tetrahydropyridin-1-yl)butyl]-1,2-dihydrophthalazin-1-one phthalazinone analogue, 9a
TypeSmall organic molecule
Emp. Form.C23H25N3O
Mol. Mass.359.4641
SMILESO=c1[nH]nc(CCCCN2CCC(=CC2)c2ccccc2)c2ccccc12