Reaction Details
TargetPoly [ADP-ribose] polymerase 2
LigandBDBM27721
Substrate/CompetitorBDBM27683
Meas. Tech.PARP Enzyme Inhibition Assay
Temperature298.15±n/a K
IC50 8±n/a nM
Commentsextracted
Citation Ishida, JYamamoto, HKido, YKamijo, KMurano, KMiyake, HOhkubo, MKinoshita, TWarizaya, MIwashita, AMihara, KMatsuoka, NHattori, K Discovery of potent and selective PARP-1 and PARP-2 inhibitors: SBDD analysis via a combination of X-ray structural study and homology modeling. Bioorg Med Chem14:1378-90 (2006) 
 
Poly [ADP-ribose] polymerase 2
Name:Poly [ADP-ribose] polymerase 2
Type:n/a
Mol. Mass.:63409.97
Organism:Mus musculus (Mouse)
Description:Alexis Biochemicals, Cat. no. ALX-201-064-C020
Residue:559
BDBM27721
BDBM27683
NameBDBM27721
Synonyms:3-(4-cyanophenyl)quinoxaline-5-carboxamide quinoxaline analogue, 3c
TypeSmall organic molecule
Emp. Form.C16H10N4O
Mol. Mass.274.2768
SMILESNC(=O)c1cccc2ncc(nc12)-c1ccc(cc1)C#N