Reaction Details
TargetPoly [ADP-ribose] polymerase 2
LigandBDBM27724
Substrate/CompetitorBDBM27683
Meas. Tech.PARP Enzyme Inhibition Assay
Temperature298.15±n/a K
IC50 9±n/a nM
Commentsextracted
Citation Ishida, JYamamoto, HKido, YKamijo, KMurano, KMiyake, HOhkubo, MKinoshita, TWarizaya, MIwashita, AMihara, KMatsuoka, NHattori, K Discovery of potent and selective PARP-1 and PARP-2 inhibitors: SBDD analysis via a combination of X-ray structural study and homology modeling. Bioorg Med Chem14:1378-90 (2006) 
 
Poly [ADP-ribose] polymerase 2
Name:Poly [ADP-ribose] polymerase 2
Type:n/a
Mol. Mass.:63409.97
Organism:Mus musculus (Mouse)
Description:Alexis Biochemicals, Cat. no. ALX-201-064-C020
Residue:559
BDBM27724
BDBM27683
NameBDBM27724
Synonyms:3-(4-aminophenyl)quinoxaline-5-carboxamide quinoxaline analogue, 3f
TypeSmall organic molecule
Emp. Form.C15H12N4O
Mol. Mass.264.282
SMILESNC(=O)c1cccc2ncc(nc12)-c1ccc(N)cc1