Reaction Details
TargetHistone deacetylase 1
LigandBDBM27781
Substrate/CompetitorBDBM25143
Meas. Tech.HDAC Activity Assay
pH8±n/a
Temperature310.15±n/a K
IC50 12±n/a nM
Citation Kattar, SDSurdi, LMZabierek, AMethot, JLMiddleton, REHughes, BSzewczak, AADahlberg, WKKral, AMOzerova, NFleming, JCWang, HSecrist, PHarsch, AHamill, JECruz, JCKenific, CMChenard, MMiller, TABerk, SCTempest, P Parallel medicinal chemistry approaches to selective HDAC1/HDAC2 inhibitor (SHI-1:2) optimization. Bioorg Med Chem Lett19:1168-72 (2009) 
 
Histone deacetylase 1
Name:Histone deacetylase 1
Type:Enzyme
Mol. Mass.:55090.27
Organism:Homo sapiens (Human)
Description:Q13547
Residue:482
BDBM27781
BDBM25143
NameBDBM27781
Synonyms:N-[2-amino-5-(4-fluorophenyl)phenyl]-4-{1,8-diazaspiro[4.5]decan-8-ylcarbonyl}benzamide | terephthalamide, 29
TypeSmall organic molecule
Emp. Form.C28H29FN4O2
Mol. Mass.472.5539
SMILESNc1ccc(cc1NC(=O)c1ccc(cc1)C(=O)N1CCC2(CCCN2)CC1)-c1ccc(F)cc1