Reaction Details
Target5-hydroxytryptamine receptor 6
LigandBDBM28589
Substrate/CompetitorBDBM21342
Meas. Tech.Filtration Binding Assay
pH7.5±n/a
Temperature295.15±n/a K
Ki 9.3±n/a nM
Citation Singer, JMWilson, MWJohnson, PDGraham, SRCooke, LWRoof, RLBoxer, PAGold, LHMeltzer, LTJanssen, ARoush, NCampbell, JESu, TZHurst, SIStoner, CLSchwarz, JB Synthesis and SAR of tolylamine 5-HT6 antagonists. Bioorg Med Chem Lett19:2409-12 (2009) 
 
5-hydroxytryptamine receptor 6
Name:5-hydroxytryptamine receptor 6
Type:G Protein-Coupled Receptor (GPCR)
Mol. Mass.:46968.43
Organism:Homo sapiens (Human)
Description:P50406
Residue:440
BDBM28589
BDBM21342
NameBDBM28589
Synonyms:1-{3-[(3,4-difluorophenyl)methoxy]-2-methylphenyl}piperazine | tolylpiperazine, 5e
TypeSmall organic molecule
Emp. Form.C18H20F2N2O
Mol. Mass.318.361
SMILESCc1c(OCc2ccc(F)c(F)c2)cccc1N1CCNCC1