Reaction Details
Target5-hydroxytryptamine receptor 6
LigandBDBM28592
Substrate/CompetitorBDBM21342
Meas. Tech.Filtration Binding Assay
pH7.5±n/a
Temperature295.15±n/a K
Ki 45.6±n/a nM
Citation Singer, JMWilson, MWJohnson, PDGraham, SRCooke, LWRoof, RLBoxer, PAGold, LHMeltzer, LTJanssen, ARoush, NCampbell, JESu, TZHurst, SIStoner, CLSchwarz, JB Synthesis and SAR of tolylamine 5-HT6 antagonists. Bioorg Med Chem Lett19:2409-12 (2009) 
 
5-hydroxytryptamine receptor 6
Name:5-hydroxytryptamine receptor 6
Type:G Protein-Coupled Receptor (GPCR)
Mol. Mass.:46968.43
Organism:Homo sapiens (Human)
Description:P50406
Residue:440
BDBM28592
BDBM21342
NameBDBM28592
Synonyms:1-{2-methyl-3-[(1S)-1-phenylethoxy]phenyl}piperazine | tolylpiperazine, 5h
TypeSmall organic molecule
Emp. Form.C19H24N2O
Mol. Mass.296.4067
SMILESC[C@H](Oc1cccc(N2CCNCC2)c1C)c1ccccc1