Reaction Details
Target5-hydroxytryptamine receptor 6
LigandBDBM28594
Substrate/CompetitorBDBM21342
Meas. Tech.Filtration Binding Assay
pH7.5±n/a
Temperature295.15±n/a K
Ki 2.5±n/a nM
Citation Singer, JMWilson, MWJohnson, PDGraham, SRCooke, LWRoof, RLBoxer, PAGold, LHMeltzer, LTJanssen, ARoush, NCampbell, JESu, TZHurst, SIStoner, CLSchwarz, JB Synthesis and SAR of tolylamine 5-HT6 antagonists. Bioorg Med Chem Lett19:2409-12 (2009) 
 
5-hydroxytryptamine receptor 6
Name:5-hydroxytryptamine receptor 6
Type:G Protein-Coupled Receptor (GPCR)
Mol. Mass.:46968.43
Organism:Homo sapiens (Human)
Description:P50406
Residue:440
BDBM28594
BDBM21342
NameBDBM28594
Synonyms:4-{3-[(3-fluorophenyl)methoxy]-2-methylphenyl}piperidine | tolylpiperidine, 9a
TypeSmall organic molecule
Emp. Form.C19H22FNO
Mol. Mass.299.3825
SMILESCc1c(OCc2cccc(F)c2)cccc1C1CCNCC1