Reaction Details
Target5-hydroxytryptamine receptor 6
LigandBDBM28599
Substrate/CompetitorBDBM21342
Meas. Tech.Filtration Binding Assay
pH7.5±n/a
Temperature295.15±n/a K
Ki 219±n/a nM
Citation Singer, JMWilson, MWJohnson, PDGraham, SRCooke, LWRoof, RLBoxer, PAGold, LHMeltzer, LTJanssen, ARoush, NCampbell, JESu, TZHurst, SIStoner, CLSchwarz, JB Synthesis and SAR of tolylamine 5-HT6 antagonists. Bioorg Med Chem Lett19:2409-12 (2009) 
 
5-hydroxytryptamine receptor 6
Name:5-hydroxytryptamine receptor 6
Type:G Protein-Coupled Receptor (GPCR)
Mol. Mass.:46968.43
Organism:Homo sapiens (Human)
Description:P50406
Residue:440
BDBM28599
BDBM21342
NameBDBM28599
Synonyms:4-{3-[(3,4-dichlorophenyl)methoxy]-2-methylphenyl}piperidine | tolylpiperidine, 9f
TypeSmall organic molecule
Emp. Form.C19H21Cl2NO
Mol. Mass.350.282
SMILESCc1c(OCc2ccc(Cl)c(Cl)c2)cccc1C1CCNCC1