Reaction Details
Target5-hydroxytryptamine receptor 6
LigandBDBM28603
Substrate/CompetitorBDBM21342
Meas. Tech.Filtration Binding Assay
pH7.5±n/a
Temperature295.15±n/a K
Ki 2.8±n/a nM
Citation Singer, JMWilson, MWJohnson, PDGraham, SRCooke, LWRoof, RLBoxer, PAGold, LHMeltzer, LTJanssen, ARoush, NCampbell, JESu, TZHurst, SIStoner, CLSchwarz, JB Synthesis and SAR of tolylamine 5-HT6 antagonists. Bioorg Med Chem Lett19:2409-12 (2009) 
 
5-hydroxytryptamine receptor 6
Name:5-hydroxytryptamine receptor 6
Type:G Protein-Coupled Receptor (GPCR)
Mol. Mass.:46968.43
Organism:Homo sapiens (Human)
Description:P50406
Residue:440
BDBM28603
BDBM21342
NameBDBM28603
Synonyms:4-{3-[(1S)-1-(3-chlorophenyl)ethoxy]-2-methylphenyl}piperidine | tolylpiperidine, 9k
TypeSmall organic molecule
Emp. Form.C20H24ClNO
Mol. Mass.329.864
SMILESC[C@H](Oc1cccc(C2CCNCC2)c1C)c1cccc(Cl)c1