Reaction Details
TargetSteroidogenic factor 1
LigandBDBM28647
Substrate/CompetitorBDBM10852
Meas. Tech.Transactivation Cell-Based Assay
EC50 200±40 nM
Citation Roth, JMadoux, FHodder, PRoush, WR Synthesis of small molecule inhibitors of the orphan nuclear receptor steroidogenic factor-1 (NR5A1) based on isoquinolinone scaffolds. Bioorg Med Chem Lett18:2628-32 (2008) 
 
Steroidogenic factor 1
Name:Steroidogenic factor 1
Type:Nuclear Hormone Receptor
Mol. Mass.:51643.43
Organism:Homo sapiens (Human)
Description:n/a
Residue:461
BDBM28647
BDBM10852
NameBDBM28647
Synonyms:ethyl 2-[(2-{[(4-methoxyphenyl)carbamoyl]methyl}-1-oxo-1,2-dihydroisoquinolin-5-yl)oxy]propanoate | isoquinolinone scaffold, 31
TypeSmall organic molecule
Emp. Form.C23H24N2O6
Mol. Mass.424.4465
SMILESCCOC(=O)C(C)Oc1cccc2c1ccn(CC(=O)Nc1ccc(OC)cc1)c2=O