Reaction Details
TargetSteroidogenic factor 1
LigandBDBM28650
Substrate/CompetitorBDBM10852
Meas. Tech.Transactivation Cell-Based Assay
EC50 110±40 nM
Citation Roth, JMadoux, FHodder, PRoush, WR Synthesis of small molecule inhibitors of the orphan nuclear receptor steroidogenic factor-1 (NR5A1) based on isoquinolinone scaffolds. Bioorg Med Chem Lett18:2628-32 (2008) 
 
Steroidogenic factor 1
Name:Steroidogenic factor 1
Type:Nuclear Hormone Receptor
Mol. Mass.:51643.43
Organism:Homo sapiens (Human)
Description:n/a
Residue:461
BDBM28650
BDBM10852
NameBDBM28650
Synonyms:ethyl 2-[(2-{[(4-ethylphenyl)carbamoyl]methyl}-1-oxo-1,2-dihydroisoquinolin-5-yl)oxy]propanoate | isoquinolinone scaffold, 34
TypeSmall organic molecule
Emp. Form.C24H26N2O5
Mol. Mass.422.4736
SMILESCCOC(=O)C(C)Oc1cccc2c1ccn(CC(=O)Nc1ccc(CC)cc1)c2=O