Reaction Details
TargetAryl hydrocarbon receptor
LigandBDBM50049057
Substrate/Competitorn/a
Meas. Tech.Pharmacological Assay
EC50 86.0±40 nM
Citation Tang, WLi, XShu, DWinston-McPherson, GN Synthesis of diindolylmethanes and indolo[3,2-b]carbazoles, compounds formed thereby, and pharmaceutical compositions containing them US Patent US9969686 Publication Date 5/15/2018
 
Aryl hydrocarbon receptor
Name:Aryl hydrocarbon receptor
Type:PROTEIN
Mol. Mass.:96143.77
Organism:Homo sapiens (Human)
Description:ChEMBL_1503828
Residue:848
BDBM50049057
NameBDBM50049057
Synonyms:CHEMBL3319505 US9969686, Compound 10d
TypeSmall organic molecule
Emp. Form.C18H16N2
Mol. Mass.260.333
SMILESCn1cc(Cc2cc3ccccc3[nH]2)c2ccccc12