Reaction Details
TargetC-C chemokine receptor type 9
LigandBDBM393572
Substrate/Competitorn/a
Meas. Tech.FLIPR Assay
Ki 3.00±n/a nM
Citation Bakthavatchalam, RBasu, MKBehera, AKVenkateshappa, CHewson, CAKadnur, SVKalindjian, SBKulkarni, BSaxena, RSuresh, JViswanathan, VZainuddin, MDharshinis, APKristam, R Compounds useful as CCR9 modulators US Patent US9969687 Publication Date 5/15/2018
 
C-C chemokine receptor type 9
Name:C-C chemokine receptor type 9
Type:PROTEIN
Mol. Mass.:42023.90
Organism:Homo sapiens (Human)
Description:ChEMBL_1510356
Residue:369
BDBM393572
NameBDBM393572
Synonyms:US9969687, Compound 244
TypeSmall organic molecule
Emp. Form.C24H22ClN3O4S
Mol. Mass.483.967
SMILESCc1cnccc1N1C(=O)c2c(C1=O)c(NS(=O)(=O)c1ccc(cc1)C(C)(C)C)ccc2Cl